Information card for entry 1562535
Formula | C26 H15 Eu N2 O10 |
Calculated formula | C26 H15 Eu N2 O10 |
Title of publication | Lanthanide coordination polymers based on multi-donor ligand containing pyridine and phthalate moieties: Structures, luminescence and magnetic properties |
Authors of publication | Feng, Xun; Liu, Lang; Wang, Li-Ya; Song, Hong-Liang; Qiang Shi, Zhi; Wu, Xu-Hong; Ng, Seik-Weng |
Journal of publication | Journal of Solid State Chemistry |
Year of publication | 2013 |
Journal volume | 206 |
Pages of publication | 277 - 285 |
a | 7.6625 ± 0.0008 Å |
b | 10.6656 ± 0.0011 Å |
c | 14.3777 ± 0.0015 Å |
α | 75.587 ± 0.001° |
β | 84.551 ± 0.001° |
γ | 75.942 ± 0.001° |
Cell volume | 1103.2 ± 0.2 Å3 |
Cell temperature | 293 ± 2 K |
Ambient diffraction temperature | 293 ± 2 K |
Number of distinct elements | 5 |
Space group number | 2 |
Hermann-Mauguin space group symbol | P -1 |
Hall space group symbol | -P 1 |
Residual factor for all reflections | 0.021 |
Residual factor for significantly intense reflections | 0.0201 |
Weighted residual factors for significantly intense reflections | 0.0508 |
Weighted residual factors for all reflections included in the refinement | 0.0513 |
Goodness-of-fit parameter for all reflections included in the refinement | 1.044 |
Diffraction radiation wavelength | 0.71073 Å |
Diffraction radiation type | MoKα |