Information card for entry 1562536
Formula | C26 H15 Gd N2 O10 |
Calculated formula | C26 H15 Gd N2 O10 |
Title of publication | Lanthanide coordination polymers based on multi-donor ligand containing pyridine and phthalate moieties: Structures, luminescence and magnetic properties |
Authors of publication | Feng, Xun; Liu, Lang; Wang, Li-Ya; Song, Hong-Liang; Qiang Shi, Zhi; Wu, Xu-Hong; Ng, Seik-Weng |
Journal of publication | Journal of Solid State Chemistry |
Year of publication | 2013 |
Journal volume | 206 |
Pages of publication | 277 - 285 |
a | 7.644 ± 0.003 Å |
b | 10.634 ± 0.004 Å |
c | 14.374 ± 0.005 Å |
α | 75.506 ± 0.005° |
β | 84.422 ± 0.006° |
γ | 75.941 ± 0.005° |
Cell volume | 1096.5 ± 0.7 Å3 |
Cell temperature | 296 ± 2 K |
Ambient diffraction temperature | 296 ± 2 K |
Number of distinct elements | 5 |
Space group number | 2 |
Hermann-Mauguin space group symbol | P -1 |
Hall space group symbol | -P 1 |
Residual factor for all reflections | 0.0254 |
Residual factor for significantly intense reflections | 0.0227 |
Weighted residual factors for significantly intense reflections | 0.0585 |
Weighted residual factors for all reflections included in the refinement | 0.0602 |
Goodness-of-fit parameter for all reflections included in the refinement | 1.022 |
Diffraction radiation wavelength | 0.71073 Å |
Diffraction radiation type | MoKα |