Information card for entry 1568113
Formula | C10 H6 N O8 Re |
Calculated formula | C10 H6 N O8 Re |
Title of publication | Enantioselective inhibition of the SARS-CoV-2 main protease with rhenium(i) picolinic acid complexes. |
Authors of publication | Karges, Johannes; Giardini, Miriam A.; Blacque, Olivier; Woodworth, Brendon; Siqueira-Neto, Jair L; Cohen, Seth M. |
Journal of publication | Chemical science |
Year of publication | 2023 |
Journal volume | 14 |
Journal issue | 3 |
Pages of publication | 711 - 720 |
a | 10.5413 ± 0.0001 Å |
b | 6.8478 ± 0.0001 Å |
c | 17.1068 ± 0.0002 Å |
α | 90° |
β | 103.515 ± 0.001° |
γ | 90° |
Cell volume | 1200.65 ± 0.03 Å3 |
Cell temperature | 160 ± 1 K |
Ambient diffraction temperature | 160 ± 1 K |
Number of distinct elements | 5 |
Space group number | 14 |
Hermann-Mauguin space group symbol | P 1 21/c 1 |
Hall space group symbol | -P 2ybc |
Residual factor for all reflections | 0.0232 |
Residual factor for significantly intense reflections | 0.0232 |
Weighted residual factors for significantly intense reflections | 0.0595 |
Weighted residual factors for all reflections included in the refinement | 0.0595 |
Goodness-of-fit parameter for all reflections included in the refinement | 1.274 |
Diffraction radiation probe | x-ray |
Diffraction radiation wavelength | 1.54184 Å |
Diffraction radiation type | CuKα |