Information card for entry 1568114
Formula | C10 H10 N O8 Re |
Calculated formula | C10 H10 N O8 Re |
Title of publication | Enantioselective inhibition of the SARS-CoV-2 main protease with rhenium(i) picolinic acid complexes. |
Authors of publication | Karges, Johannes; Giardini, Miriam A.; Blacque, Olivier; Woodworth, Brendon; Siqueira-Neto, Jair L; Cohen, Seth M. |
Journal of publication | Chemical science |
Year of publication | 2023 |
Journal volume | 14 |
Journal issue | 3 |
Pages of publication | 711 - 720 |
a | 24.6135 ± 0.0001 Å |
b | 11.2159 ± 0.0001 Å |
c | 9.5651 ± 0.0001 Å |
α | 90° |
β | 94.071 ± 0.001° |
γ | 90° |
Cell volume | 2633.9 ± 0.04 Å3 |
Cell temperature | 160 ± 1 K |
Ambient diffraction temperature | 160 ± 1 K |
Number of distinct elements | 5 |
Space group number | 15 |
Hermann-Mauguin space group symbol | C 1 2/c 1 |
Hall space group symbol | -C 2yc |
Residual factor for all reflections | 0.0123 |
Residual factor for significantly intense reflections | 0.0123 |
Weighted residual factors for significantly intense reflections | 0.0309 |
Weighted residual factors for all reflections included in the refinement | 0.0309 |
Goodness-of-fit parameter for all reflections included in the refinement | 1.216 |
Diffraction radiation probe | x-ray |
Diffraction radiation wavelength | 1.54184 Å |
Diffraction radiation type | CuKα |