Information card for entry 1569122
Formula | C19 H19 Cl N4 O |
Calculated formula | C19 H19 Cl N4 O |
Title of publication | Photoluminescence control by atomically precise surface metallization of C-centered hexagold(i) clusters using N-heterocyclic carbenes. |
Authors of publication | Lei, Zhen; Zhao, Pei; Pei, Xiao-Li; Ube, Hitoshi; Ehara, Masahiro; Shionoya, Mitsuhiko |
Journal of publication | Chemical science |
Year of publication | 2023 |
Journal volume | 14 |
Journal issue | 23 |
Pages of publication | 6207 - 6215 |
a | 13.3991 ± 0.0002 Å |
b | 9.824 ± 0.0001 Å |
c | 13.8269 ± 0.0002 Å |
α | 90° |
β | 105.917 ± 0.001° |
γ | 90° |
Cell volume | 1750.29 ± 0.04 Å3 |
Cell temperature | 93 ± 2 K |
Ambient diffraction temperature | 93 ± 2 K |
Number of distinct elements | 5 |
Space group number | 14 |
Hermann-Mauguin space group symbol | P 1 21/n 1 |
Hall space group symbol | -P 2yn |
Residual factor for all reflections | 0.0401 |
Residual factor for significantly intense reflections | 0.0393 |
Weighted residual factors for significantly intense reflections | 0.1039 |
Weighted residual factors for all reflections included in the refinement | 0.1045 |
Goodness-of-fit parameter for all reflections included in the refinement | 1.037 |
Diffraction radiation probe | x-ray |
Diffraction radiation wavelength | 1.54184 Å |
Diffraction radiation type | CuKα |