Information card for entry 1569123
Formula | C98 H104 Au6 B2 Cl2 F8 N18 |
Calculated formula | C98 H104 Au6 B2 Cl2 F8 N18 |
Title of publication | Photoluminescence control by atomically precise surface metallization of C-centered hexagold(i) clusters using N-heterocyclic carbenes. |
Authors of publication | Lei, Zhen; Zhao, Pei; Pei, Xiao-Li; Ube, Hitoshi; Ehara, Masahiro; Shionoya, Mitsuhiko |
Journal of publication | Chemical science |
Year of publication | 2023 |
Journal volume | 14 |
Journal issue | 23 |
Pages of publication | 6207 - 6215 |
a | 13.57251 ± 0.00016 Å |
b | 22.5778 ± 0.0002 Å |
c | 17.07448 ± 0.00017 Å |
α | 90° |
β | 99.922 ± 0.0011° |
γ | 90° |
Cell volume | 5154 ± 0.09 Å3 |
Cell temperature | 93 ± 2 K |
Ambient diffraction temperature | 93 ± 2 K |
Number of distinct elements | 7 |
Space group number | 14 |
Hermann-Mauguin space group symbol | P 1 21/n 1 |
Hall space group symbol | -P 2yn |
Residual factor for all reflections | 0.0593 |
Residual factor for significantly intense reflections | 0.0496 |
Weighted residual factors for significantly intense reflections | 0.1311 |
Weighted residual factors for all reflections included in the refinement | 0.1376 |
Goodness-of-fit parameter for all reflections included in the refinement | 1.028 |
Diffraction radiation probe | x-ray |
Diffraction radiation wavelength | 1.54184 Å |
Diffraction radiation type | CuKα |