Information card for entry 1569649
Formula | C93 H121 Bi4 N2 O13 |
Calculated formula | C93 H121 Bi4 N2 O13 |
Title of publication | Electron delocalization of robust high-nuclear bismuth-oxo clusters for promoted CO<sub>2</sub> electroreduction. |
Authors of publication | Hou, Baoshan; Zheng, Haiyan; Zhang, Kunhao; Wu, Qi; Qin, Chao; Sun, Chunyi; Pan, Qinhe; Kang, Zhenhui; Wang, Xinlong; Su, Zhongmin |
Journal of publication | Chemical science |
Year of publication | 2023 |
Journal volume | 14 |
Journal issue | 33 |
Pages of publication | 8962 - 8969 |
a | 16.57 ± 0.004 Å |
b | 17.36 ± 0.004 Å |
c | 19.896 ± 0.005 Å |
α | 67.924 ± 0.011° |
β | 78.114 ± 0.012° |
γ | 83.852 ± 0.011° |
Cell volume | 5187 ± 2 Å3 |
Cell temperature | 173 ± 2 K |
Ambient diffraction temperature | 173.02 K |
Number of distinct elements | 5 |
Space group number | 2 |
Hermann-Mauguin space group symbol | P -1 |
Hall space group symbol | -P 1 |
Residual factor for all reflections | 0.069 |
Residual factor for significantly intense reflections | 0.0581 |
Weighted residual factors for significantly intense reflections | 0.1356 |
Weighted residual factors for all reflections included in the refinement | 0.1447 |
Goodness-of-fit parameter for all reflections included in the refinement | 1.076 |
Diffraction radiation probe | x-ray |
Diffraction radiation wavelength | 1.54178 Å |
Diffraction radiation type | CuKα |
Diffraction radiation X-ray symbol | K-L~3~ |