Information card for entry 1571835
Original IUCr paper | HTML |
Chemical name | (2',6'-dimethoxy-[1,1'-biphenyl]-2-yl)methanol (absorbed in crystalline sponge) |
Formula | C38.78 H26.97 I6 N12 O0.56 Zn3 |
Calculated formula | C38.7825 H26.968 I5.9998 N12 O0.5565 Zn2.9999 |
Title of publication | Statistical optimization of guest uptake in crystalline sponges: grading structural outcomes. |
Authors of publication | Carroll, Robert C.; Coles, Simon J. |
Journal of publication | IUCrJ |
Year of publication | 2024 |
Journal volume | 11 |
Journal issue | 4 |
a | 34.7075 ± 0.0008 Å |
b | 14.9722 ± 0.0003 Å |
c | 31.1023 ± 0.0009 Å |
α | 90° |
β | 102.185 ± 0.002° |
γ | 90° |
Cell volume | 15798.1 ± 0.7 Å3 |
Cell temperature | 100 ± 2 K |
Ambient diffraction temperature | 100 ± 2 K |
Number of distinct elements | 6 |
Space group number | 15 |
Hermann-Mauguin space group symbol | C 1 2/c 1 |
Hall space group symbol | -C 2yc |
Residual factor for all reflections | 0.1126 |
Residual factor for significantly intense reflections | 0.0936 |
Weighted residual factors for significantly intense reflections | 0.3026 |
Weighted residual factors for all reflections included in the refinement | 0.3224 |
Goodness-of-fit parameter for all reflections included in the refinement | 1.049 |
Diffraction radiation probe | x-ray |
Diffraction radiation wavelength | 1.54184 Å |
Diffraction radiation type | CuKα |