Information card for entry 1571836
Original IUCr paper | HTML |
Chemical name | catena-[bis(mu-2,4,6-tri(pyridin-4-yl)-1,3,5-triazine)-hexaiodo-tri-zinc |
Formula | C36 H24 I6 N12 Zn3 |
Calculated formula | C36 H24 I6 N12 Zn3 |
Title of publication | Statistical optimization of guest uptake in crystalline sponges: grading structural outcomes. |
Authors of publication | Carroll, Robert C.; Coles, Simon J. |
Journal of publication | IUCrJ |
Year of publication | 2024 |
Journal volume | 11 |
Journal issue | 4 |
a | 34.5442 ± 0.0016 Å |
b | 15.0184 ± 0.0003 Å |
c | 30.549 ± 0.002 Å |
α | 90° |
β | 101.346 ± 0.005° |
γ | 90° |
Cell volume | 15539 ± 1.3 Å3 |
Cell temperature | 100 ± 0.1 K |
Ambient diffraction temperature | 100 ± 0.1 K |
Number of distinct elements | 5 |
Space group number | 15 |
Hermann-Mauguin space group symbol | C 1 2/c 1 |
Hall space group symbol | -C 2yc |
Residual factor for all reflections | 0.1127 |
Residual factor for significantly intense reflections | 0.092 |
Weighted residual factors for significantly intense reflections | 0.2865 |
Weighted residual factors for all reflections included in the refinement | 0.3057 |
Goodness-of-fit parameter for all reflections included in the refinement | 1.111 |
Diffraction radiation probe | x-ray |
Diffraction radiation wavelength | 1.54184 Å |
Diffraction radiation type | CuKα |