Information card for entry 1571848
Original IUCr paper | HTML |
Chemical name | (2',6'-dimethoxy-[1,1'-biphenyl]-2-yl)methanol (absorbed in crystalline sponge) |
Formula | C82.77 H61.36 I12 N24 O1.75 Zn6 |
Calculated formula | C82.77 H61.3556 I12 N24 O1.7538 Zn6 |
Title of publication | Statistical optimization of guest uptake in crystalline sponges: grading structural outcomes. |
Authors of publication | Carroll, Robert C.; Coles, Simon J. |
Journal of publication | IUCrJ |
Year of publication | 2024 |
Journal volume | 11 |
Journal issue | 4 |
a | 31.387 ± 0.002 Å |
b | 15.0302 ± 0.0005 Å |
c | 34.2836 ± 0.0016 Å |
α | 90° |
β | 101.803 ± 0.005° |
γ | 90° |
Cell volume | 15831.4 ± 1.4 Å3 |
Cell temperature | 100 ± 2 K |
Ambient diffraction temperature | 100 ± 2 K |
Number of distinct elements | 6 |
Space group number | 13 |
Hermann-Mauguin space group symbol | P 1 2/n 1 |
Hall space group symbol | -P 2yac |
Residual factor for all reflections | 0.2013 |
Residual factor for significantly intense reflections | 0.1782 |
Weighted residual factors for significantly intense reflections | 0.4197 |
Weighted residual factors for all reflections included in the refinement | 0.432 |
Goodness-of-fit parameter for all reflections included in the refinement | 1.064 |
Diffraction radiation probe | x-ray |
Diffraction radiation wavelength | 1.54184 Å |
Diffraction radiation type | CuKα |