Information card for entry 1571849
Original IUCr paper | HTML |
Chemical name | (2',6'-dimethoxy-[1,1'-biphenyl]-2-yl)methanol (absorbed in crystalline sponge) |
Formula | C118.14 H82.81 I18 N36 O2.03 Zn9 |
Calculated formula | C118.137 H82.8128 I18 N36 O2.0274 Zn9 |
Title of publication | Statistical optimization of guest uptake in crystalline sponges: grading structural outcomes. |
Authors of publication | Carroll, Robert C.; Coles, Simon J. |
Journal of publication | IUCrJ |
Year of publication | 2024 |
Journal volume | 11 |
Journal issue | 4 |
a | 78.813 ± 0.002 Å |
b | 14.9644 ± 0.0003 Å |
c | 41.657 ± 0.0009 Å |
α | 90° |
β | 100.061 ± 0.002° |
γ | 90° |
Cell volume | 48374.3 ± 1.9 Å3 |
Cell temperature | 100 ± 0.1 K |
Ambient diffraction temperature | 100 ± 0.1 K |
Number of distinct elements | 6 |
Space group number | 15 |
Hermann-Mauguin space group symbol | C 1 2/c 1 |
Hall space group symbol | -C 2yc |
Residual factor for all reflections | 0.1789 |
Residual factor for significantly intense reflections | 0.1424 |
Weighted residual factors for significantly intense reflections | 0.414 |
Weighted residual factors for all reflections included in the refinement | 0.4404 |
Goodness-of-fit parameter for all reflections included in the refinement | 1.018 |
Diffraction radiation probe | x-ray |
Diffraction radiation wavelength | 1.54184 Å |
Diffraction radiation type | CuKα |