Information card for entry 1571873
Original IUCr paper | HTML |
Chemical name | [1,1'-biphenyl]-2-yl)methanol (absorbed in crystalline sponge) |
Formula | C100.99 H91.97 I12 N24 O2.88 Zn6 |
Calculated formula | C100.985 H92.5388 I12 N24 O2.8779 Zn6 |
Title of publication | Statistical optimization of guest uptake in crystalline sponges: grading structural outcomes. |
Authors of publication | Carroll, Robert C.; Coles, Simon J. |
Journal of publication | IUCrJ |
Year of publication | 2024 |
Journal volume | 11 |
Journal issue | 4 |
a | 31.5077 ± 0.0005 Å |
b | 14.9991 ± 0.0001 Å |
c | 34.4289 ± 0.0006 Å |
α | 90° |
β | 102.086 ± 0.001° |
γ | 90° |
Cell volume | 15910 ± 0.4 Å3 |
Cell temperature | 100 ± 2 K |
Ambient diffraction temperature | 100 ± 2 K |
Number of distinct elements | 6 |
Space group number | 13 |
Hermann-Mauguin space group symbol | P 1 2/n 1 |
Hall space group symbol | -P 2yac |
Residual factor for all reflections | 0.0848 |
Residual factor for significantly intense reflections | 0.0705 |
Weighted residual factors for significantly intense reflections | 0.2089 |
Weighted residual factors for all reflections included in the refinement | 0.2208 |
Goodness-of-fit parameter for all reflections included in the refinement | 1.064 |
Diffraction radiation probe | x-ray |
Diffraction radiation wavelength | 1.54184 Å |
Diffraction radiation type | CuKα |