Information card for entry 1571874
Original IUCr paper | HTML |
Chemical name | (2',6'-dimethoxy-[1,1'-biphenyl]-2-yl)methanol (absorbed in crystalline sponge) |
Formula | C90.17 H71.8 I12 N24 O2.69 Zn6 |
Calculated formula | C90.1692 H71.7972 I11.9978 N24 O2.6874 Zn5.9989 |
Title of publication | Statistical optimization of guest uptake in crystalline sponges: grading structural outcomes. |
Authors of publication | Carroll, Robert C.; Coles, Simon J. |
Journal of publication | IUCrJ |
Year of publication | 2024 |
Journal volume | 11 |
Journal issue | 4 |
a | 31.5685 ± 0.0008 Å |
b | 15.041 ± 0.0003 Å |
c | 34.3133 ± 0.0009 Å |
α | 90° |
β | 101.955 ± 0.002° |
γ | 90° |
Cell volume | 15939.3 ± 0.7 Å3 |
Cell temperature | 100 ± 2 K |
Ambient diffraction temperature | 100 ± 2 K |
Number of distinct elements | 6 |
Space group number | 13 |
Hermann-Mauguin space group symbol | P 1 2/n 1 |
Hall space group symbol | -P 2yac |
Residual factor for all reflections | 0.1411 |
Residual factor for significantly intense reflections | 0.1219 |
Weighted residual factors for significantly intense reflections | 0.3322 |
Weighted residual factors for all reflections included in the refinement | 0.3445 |
Goodness-of-fit parameter for all reflections included in the refinement | 1.091 |
Diffraction radiation probe | x-ray |
Diffraction radiation wavelength | 1.54184 Å |
Diffraction radiation type | CuKα |