Information card for entry 1572155
Formula |
C45 H41 N3 O6 |
Calculated formula |
C45 H41 N3 O6 |
Title of publication |
Access to distal biaxial atropisomers by iridium catalyzed asymmetric C-H alkylation. |
Authors of publication |
Hu, Xueqing; Zhao, Yunxu; He, Tong; Niu, Caoyue; Liu, Feipeng; Jia, Wei; Mu, Yi; Li, Xingwei; Rong, Zi-Qiang |
Journal of publication |
Chemical science |
Year of publication |
2024 |
Journal volume |
15 |
Journal issue |
33 |
Pages of publication |
13541 - 13549 |
a |
10.0009 ± 0.0005 Å |
b |
11.0174 ± 0.0006 Å |
c |
34.0362 ± 0.0018 Å |
α |
90° |
β |
90° |
γ |
90° |
Cell volume |
3750.2 ± 0.3 Å3 |
Cell temperature |
193 K |
Ambient diffraction temperature |
193 K |
Number of distinct elements |
4 |
Space group number |
19 |
Hermann-Mauguin space group symbol |
P 21 21 21 |
Hall space group symbol |
P 2ac 2ab |
Residual factor for all reflections |
0.0575 |
Residual factor for significantly intense reflections |
0.0557 |
Weighted residual factors for significantly intense reflections |
0.1536 |
Weighted residual factors for all reflections included in the refinement |
0.157 |
Goodness-of-fit parameter for all reflections included in the refinement |
1.086 |
Diffraction radiation wavelength |
1.54178 Å |
Diffraction radiation type |
CuKα |
Yes |
Yes |
No |