Information card for entry 2020015
Chemical name |
Potassium thulium sulfide |
Formula |
K S2 Tm |
Calculated formula |
K S2 Tm |
Title of publication |
Structure determination of KScS~2~, RbScS~2~ and KLnS~2~ (Ln = Nd, Sm, Tb, Dy, Ho, Er, Tm and Yb) and crystal‒chemical discussion |
Authors of publication |
Havlák, Lubomír; Fábry, Jan; Henriques, Margarida; Dušek, Michal |
Journal of publication |
Acta Crystallographica Section C |
Year of publication |
2015 |
Journal volume |
71 |
Journal issue |
7 |
Pages of publication |
623 - 630 |
a |
3.9761 ± 0.0005 Å |
b |
3.9761 ± 0.0005 Å |
c |
21.841 ± 0.003 Å |
α |
90° |
β |
90° |
γ |
120° |
Cell volume |
299.03 ± 0.07 Å3 |
Cell temperature |
293 K |
Ambient diffraction temperature |
293 K |
Number of distinct elements |
3 |
Space group number |
166 |
Hermann-Mauguin space group symbol |
R -3 m :H |
Hall space group symbol |
-R 3 2" |
Residual factor for all reflections |
0.0162 |
Residual factor for significantly intense reflections |
0.0162 |
Weighted residual factors for significantly intense reflections |
0.0395 |
Weighted residual factors for all reflections included in the refinement |
0.0395 |
Goodness-of-fit parameter for all reflections included in the refinement |
1.12 |
Diffraction radiation wavelength |
0.71073 Å |
Diffraction radiation type |
MoKα |
Yes |
No |
Yes |