Information card for entry 2020016
Chemical name |
Potassium ytterbium sulfide |
Formula |
K S2 Yb |
Calculated formula |
K S2 Yb |
Title of publication |
Structure determination of KScS~2~, RbScS~2~ and KLnS~2~ (Ln = Nd, Sm, Tb, Dy, Ho, Er, Tm and Yb) and crystal‒chemical discussion |
Authors of publication |
Havlák, Lubomír; Fábry, Jan; Henriques, Margarida; Dušek, Michal |
Journal of publication |
Acta Crystallographica Section C |
Year of publication |
2015 |
Journal volume |
71 |
Journal issue |
7 |
Pages of publication |
623 - 630 |
a |
3.9615 ± 0.0008 Å |
b |
3.9615 ± 0.0008 Å |
c |
21.81 ± 0.003 Å |
α |
90° |
β |
90° |
γ |
120° |
Cell volume |
296.42 ± 0.09 Å3 |
Cell temperature |
301 ± 0.15 K |
Ambient diffraction temperature |
301 K |
Number of distinct elements |
3 |
Space group number |
166 |
Hermann-Mauguin space group symbol |
R -3 m :H |
Hall space group symbol |
-R 3 2" |
Residual factor for all reflections |
0.0287 |
Residual factor for significantly intense reflections |
0.0287 |
Weighted residual factors for significantly intense reflections |
0.0691 |
Weighted residual factors for all reflections included in the refinement |
0.0691 |
Goodness-of-fit parameter for all reflections included in the refinement |
1.65 |
Diffraction radiation wavelength |
0.71073 Å |
Diffraction radiation type |
MoKα |
Yes |
No |
Yes |