Information card for entry 2102232
Original IUCr paper | HTML |
Formula | C18 H36 Ca N10 O16 |
Calculated formula | C18 H36 Ca N10 O16 |
SMILES | c1(nc(c(N=O)c(=O)n1C)N)N[C@@H]([C@@H](C)O)C(=O)[O-].O.O.O.[Ca+2].c1(nc(c(N=O)c(=O)n1C)N)N[C@@H]([C@@H](C)O)C(=O)[O-].O.O.O |
Title of publication | Hydrated metal(II) complexes of <i>N</i>-(6-amino-3,4-dihydro-3-methyl-5-nitroso-4-oxopyrimidin-2-yl) derivatives of glycine, glycylglycine, threonine, serine, valine and methionine: a monomeric complex and coordination polymers in one, two and three dimensions linked by hydrogen bonding |
Authors of publication | Godino Salido, M. Luz; Arranz Mascarós, Paloma; López Garzón, Rafael; Gutiérrez Valero, M. Dolores; Low, John N.; Gallagher, John F.; Glidewell, Christopher |
Journal of publication | Acta Crystallographica Section B |
Year of publication | 2004 |
Journal volume | 60 |
Journal issue | 1 |
Pages of publication | 46 - 64 |
a | 30.2259 ± 0.0011 Å |
b | 6.4043 ± 0.0002 Å |
c | 7.3667 ± 0.0003 Å |
α | 90° |
β | 94.61 ± 0.002° |
γ | 90° |
Cell volume | 1421.4 ± 0.09 Å3 |
Cell temperature | 120 ± 2 K |
Ambient diffraction temperature | 120 ± 2 K |
Number of distinct elements | 5 |
Space group number | 5 |
Hermann-Mauguin space group symbol | C 1 2 1 |
Hall space group symbol | C 2y |
Residual factor for all reflections | 0.0785 |
Residual factor for significantly intense reflections | 0.0485 |
Weighted residual factors for significantly intense reflections | 0.0872 |
Weighted residual factors for all reflections included in the refinement | 0.096 |
Goodness-of-fit parameter for all reflections included in the refinement | 1.025 |
Diffraction radiation wavelength | 0.71073 Å |
Diffraction radiation type | MoKα |