Information card for entry 2102233
Original IUCr paper | HTML |
Formula | C18 H36 N10 O16 Sr |
Calculated formula | C18 H36 N10 O16 Sr |
SMILES | c1(nc(c(N=O)c(=O)n1C)N)N[C@@H]([C@@H](C)O)C(=O)[O-].O.O.O.[Sr+2].c1(nc(c(N=O)c(=O)n1C)N)N[C@@H]([C@@H](C)O)C(=O)[O-].O.O.O |
Title of publication | Hydrated metal(II) complexes of <i>N</i>-(6-amino-3,4-dihydro-3-methyl-5-nitroso-4-oxopyrimidin-2-yl) derivatives of glycine, glycylglycine, threonine, serine, valine and methionine: a monomeric complex and coordination polymers in one, two and three dimensions linked by hydrogen bonding |
Authors of publication | Godino Salido, M. Luz; Arranz Mascarós, Paloma; López Garzón, Rafael; Gutiérrez Valero, M. Dolores; Low, John N.; Gallagher, John F.; Glidewell, Christopher |
Journal of publication | Acta Crystallographica Section B |
Year of publication | 2004 |
Journal volume | 60 |
Journal issue | 1 |
Pages of publication | 46 - 64 |
a | 30.642 ± 0.0005 Å |
b | 6.4888 ± 0.0001 Å |
c | 7.3733 ± 0.0001 Å |
α | 90° |
β | 94.4319 ± 0.0009° |
γ | 90° |
Cell volume | 1461.65 ± 0.04 Å3 |
Cell temperature | 120 ± 2 K |
Ambient diffraction temperature | 120 ± 2 K |
Number of distinct elements | 5 |
Space group number | 5 |
Hermann-Mauguin space group symbol | C 1 2 1 |
Hall space group symbol | C 2y |
Residual factor for all reflections | 0.0282 |
Residual factor for significantly intense reflections | 0.0279 |
Weighted residual factors for significantly intense reflections | 0.0688 |
Weighted residual factors for all reflections included in the refinement | 0.069 |
Goodness-of-fit parameter for all reflections included in the refinement | 1.044 |
Diffraction radiation wavelength | 0.71073 Å |
Diffraction radiation type | MoKα |