Information card for entry 2102661
Original IUCr paper | HTML |
Formula | Ga4.8 Na0.8 O10 Ti1.2 |
Calculated formula | Ga4.808 Na0.807 O10 Ti1.192 |
Title of publication | Structure Refinements of Na~0.8~Ti~1.2~Ga~4.8~O~10~ at Low Temperatures: X-Ray Diffraction Analysis for Sodium Ion Distribution in a One-Dimensional Tunnel-like Space |
Authors of publication | Michiue, Yuichi; Sato, Akira |
Journal of publication | Acta Crystallographica, Section B |
Year of publication | 2004 |
Journal volume | 60 |
Journal issue | 6 |
Pages of publication | 692 - 697 |
a | 12.1008 ± 0.0008 Å |
b | 3.0113 ± 0.0002 Å |
c | 10.41 ± 0.0006 Å |
α | 90° |
β | 92.258 ± 0.004° |
γ | 90° |
Cell volume | 379.04 ± 0.04 Å3 |
Cell temperature | 299 K |
Ambient diffraction temperature | 299 K |
Number of distinct elements | 4 |
Space group number | 12 |
Hermann-Mauguin space group symbol | C 1 2/m 1 |
Hall space group symbol | -C 2y |
Residual factor for all reflections | 0.0367 |
Residual factor for significantly intense reflections | 0.028 |
Weighted residual factors for significantly intense reflections | 0.0672 |
Weighted residual factors for all reflections included in the refinement | 0.0685 |
Goodness-of-fit parameter for all reflections included in the refinement | 1.17 |
Diffraction radiation wavelength | 0.71069 Å |
Diffraction radiation type | MoKα |