Information card for entry 2102662
Original IUCr paper | HTML |
Formula | Ga4.8 Na0.8 O10 Ti1.2 |
Calculated formula | Ga4.81 Na0.811 O10 Ti1.19 |
Title of publication | Structure Refinements of Na~0.8~Ti~1.2~Ga~4.8~O~10~ at Low Temperatures: X-Ray Diffraction Analysis for Sodium Ion Distribution in a One-Dimensional Tunnel-like Space |
Authors of publication | Michiue, Yuichi; Sato, Akira |
Journal of publication | Acta Crystallographica, Section B |
Year of publication | 2004 |
Journal volume | 60 |
Journal issue | 6 |
Pages of publication | 692 - 697 |
a | 12.0848 ± 0.0012 Å |
b | 3.0101 ± 0.0003 Å |
c | 10.4014 ± 0.0009 Å |
α | 90° |
β | 92.187 ± 0.005° |
γ | 90° |
Cell volume | 378.09 ± 0.06 Å3 |
Cell temperature | 173 K |
Ambient diffraction temperature | 173 K |
Number of distinct elements | 4 |
Space group number | 12 |
Hermann-Mauguin space group symbol | C 1 2/m 1 |
Hall space group symbol | -C 2y |
Residual factor for all reflections | 0.0399 |
Residual factor for significantly intense reflections | 0.0293 |
Weighted residual factors for significantly intense reflections | 0.0658 |
Weighted residual factors for all reflections included in the refinement | 0.0673 |
Goodness-of-fit parameter for all reflections included in the refinement | 1.06 |
Diffraction radiation wavelength | 0.71069 Å |
Diffraction radiation type | MoKα |