Information card for entry 2243368
Structure factors | 2243368.hkl |
Original IUCr paper | HTML |
Chemical name | 1-(4-Azidophenyl)-3-[5-(2,4-dichlorophenoxy)-3-methyl-1-phenyl-1<i>H</i>-pyrazol-4-yl]prop-2-en-1-one |
Formula | C25 H17 Cl2 N5 O2 |
Calculated formula | C25 H17 Cl2 N5 O2 |
Title of publication | Functionalized 3-(5-aryloxy-3-methyl-1-phenyl-1<i>H</i>-pyrazol-4-yl)-1-(4-substituted-phenyl)prop-2-en-1-ones: synthetic pathway, and the structures of six examples |
Authors of publication | Kiran Kumar, Haruvegowda; Yathirajan, Hemmige S.; Asma; Manju, Nagaraja; Kalluraya, Balakrishna; Rathore, Ravindranath S.; Glidewell, Christopher |
Journal of publication | Acta Crystallographica Section E |
Year of publication | 2020 |
Journal volume | 76 |
Journal issue | 5 |
Pages of publication | 683 - 691 |
a | 28.1916 ± 0.0017 Å |
b | 8.0537 ± 0.0005 Å |
c | 22.0446 ± 0.0012 Å |
α | 90° |
β | 109.07 ± 0.001° |
γ | 90° |
Cell volume | 4730.5 ± 0.5 Å3 |
Cell temperature | 297 ± 2 K |
Ambient diffraction temperature | 297 ± 2 K |
Number of distinct elements | 5 |
Space group number | 15 |
Hermann-Mauguin space group symbol | C 1 2/c 1 |
Hall space group symbol | -C 2yc |
Residual factor for all reflections | 0.1132 |
Residual factor for significantly intense reflections | 0.0861 |
Weighted residual factors for significantly intense reflections | 0.1458 |
Weighted residual factors for all reflections included in the refinement | 0.1552 |
Goodness-of-fit parameter for all reflections included in the refinement | 1.358 |
Diffraction radiation wavelength | 0.71073 Å |
Diffraction radiation type | MoKα |