Information card for entry 2243369
Structure factors | 2243369.hkl |
Original IUCr paper | HTML |
Chemical name | 1-(4-Azidophenyl)-3-[3-methyl-5-(naphthalen-2-yloxy)-1-phenyl-1<i>H</i>-pyrazol-4-yl]prop-2-en-1-on |
Formula | C29 H21 N5 O2 |
Calculated formula | C29 H21 N5 O2 |
SMILES | C(=O)(/C=C/c1c(nn(c1Oc1cc2ccccc2cc1)c1ccccc1)C)c1ccc(cc1)N=N#N |
Title of publication | Functionalized 3-(5-aryloxy-3-methyl-1-phenyl-1<i>H</i>-pyrazol-4-yl)-1-(4-substituted-phenyl)prop-2-en-1-ones: synthetic pathway, and the structures of six examples |
Authors of publication | Kiran Kumar, Haruvegowda; Yathirajan, Hemmige S.; Asma; Manju, Nagaraja; Kalluraya, Balakrishna; Rathore, Ravindranath S.; Glidewell, Christopher |
Journal of publication | Acta Crystallographica Section E |
Year of publication | 2020 |
Journal volume | 76 |
Journal issue | 5 |
Pages of publication | 683 - 691 |
a | 9.846 ± 0.0008 Å |
b | 22.4303 ± 0.0018 Å |
c | 11.049 ± 0.0009 Å |
α | 90° |
β | 104.157 ± 0.002° |
γ | 90° |
Cell volume | 2366 ± 0.3 Å3 |
Cell temperature | 297 ± 2 K |
Ambient diffraction temperature | 297 ± 2 K |
Number of distinct elements | 4 |
Space group number | 14 |
Hermann-Mauguin space group symbol | P 1 21/n 1 |
Hall space group symbol | -P 2yn |
Residual factor for all reflections | 0.1418 |
Residual factor for significantly intense reflections | 0.0632 |
Weighted residual factors for significantly intense reflections | 0.1167 |
Weighted residual factors for all reflections included in the refinement | 0.1539 |
Goodness-of-fit parameter for all reflections included in the refinement | 1.058 |
Diffraction radiation wavelength | 0.71073 Å |
Diffraction radiation type | MoKα |