Information card for entry 2243545
Structure factors | 2243545.hkl |
Original IUCr paper | HTML |
Chemical name | Bis[μ-1κ<i>N</i>:2(η^6^)-diphenylamido]bis[bis(diphenylamido-κ<i>N</i>)dysprosium(III)] |
Formula | C72 H60 Dy2 N6 |
Calculated formula | C72 H60 Dy2 N6 |
SMILES | N(c1ccccc1)(c1ccccc1)[Dy](N(c1ccccc1)c1ccccc1)N(c1ccccc1)c1ccccc1 |
Title of publication | Synthesis and crystallographic characterization of diphenylamide rare-earth metal complexes <i>Ln</i>(NPh~2~)~3~(THF)~2~ and [(Ph~2~N)~2~<i>Ln</i>(μ-NPh~2~)]~2~ |
Authors of publication | Palumbo, Chad T.; Kotyk, Christopher M.; Ziller, Joseph W.; Evans, William J. |
Journal of publication | Acta Crystallographica Section E |
Year of publication | 2020 |
Journal volume | 76 |
Journal issue | 9 |
Pages of publication | 1447 - 1453 |
a | 9.3068 ± 0.0015 Å |
b | 22.475 ± 0.004 Å |
c | 13.513 ± 0.002 Å |
α | 90° |
β | 91.266 ± 0.002° |
γ | 90° |
Cell volume | 2825.8 ± 0.8 Å3 |
Cell temperature | 88 ± 2 K |
Ambient diffraction temperature | 88 ± 2 K |
Number of distinct elements | 4 |
Space group number | 14 |
Hermann-Mauguin space group symbol | P 1 21/c 1 |
Hall space group symbol | -P 2ybc |
Residual factor for all reflections | 0.0331 |
Residual factor for significantly intense reflections | 0.0255 |
Weighted residual factors for significantly intense reflections | 0.0611 |
Weighted residual factors for all reflections included in the refinement | 0.0652 |
Goodness-of-fit parameter for all reflections included in the refinement | 1.046 |
Diffraction radiation wavelength | 0.71073 Å |
Diffraction radiation type | MoKα |