Information card for entry 2243633
Structure factors | 2243633.hkl |
Original IUCr paper | HTML |
Chemical name | Aquachlorido(nitrato-κ^2^<i>O</i>,<i>O</i>')[1-(pyridin-2-yl-κ<i>N</i>)-2-(pyridin-2-ylmethylidene-κ<i>N</i>)hydrazine-κ<i>N</i>^2^]manganase(II) |
Formula | C11 H12 Cl Mn N5 O4 |
Calculated formula | C11 H12 Cl Mn N5 O4 |
Title of publication | Crystal structure of aquachlorido(nitrato-κ^2^<i>O</i>,<i>O</i>')[1-(pyridin-2-yl-κ<i>N</i>)-2-(pyridin-2-ylmethylidene-κ<i>N</i>)hydrazine-κ<i>N</i>^2^]manganase(II) |
Authors of publication | Sarr, Mamour; Diop, Mayoro; Thiam, Elhadj Ibrahima; Barry, Aliou Hamady; Gaye, Mohamed; Retailleau, Pascal |
Journal of publication | Acta Crystallographica Section E |
Year of publication | 2018 |
Journal volume | 74 |
Journal issue | 4 |
Pages of publication | 450 - 453 |
a | 6.9698 ± 0.0001 Å |
b | 10.6055 ± 0.0002 Å |
c | 10.8476 ± 0.0002 Å |
α | 98.784 ± 0.002° |
β | 97.636 ± 0.002° |
γ | 108.308 ± 0.002° |
Cell volume | 738.21 ± 0.03 Å3 |
Cell temperature | 293 ± 2 K |
Ambient diffraction temperature | 293 ± 2 K |
Number of distinct elements | 6 |
Space group number | 2 |
Hermann-Mauguin space group symbol | P -1 |
Hall space group symbol | -P 1 |
Residual factor for all reflections | 0.0444 |
Residual factor for significantly intense reflections | 0.0337 |
Weighted residual factors for significantly intense reflections | 0.0854 |
Weighted residual factors for all reflections included in the refinement | 0.0907 |
Goodness-of-fit parameter for all reflections included in the refinement | 1.061 |
Diffraction radiation wavelength | 0.71073 Å |
Diffraction radiation type | MoKα |