Information card for entry 2243634
Structure factors | 2243634.hkl |
Chemical name | [2,2-Bis(η^5^-pentamethylcyclopentadienyl)-3,4-bis(trimethylsilyl)-2-zirconafuran-5-one-κ<i>O</i>^5^]triisobutylaluminium |
Formula | C41 H75 Al O2 Si2 Zr |
Calculated formula | C41 H75 Al O2 Si2 Zr |
Title of publication | Synthesis and crystallographic characterization of [2,2-bis(η^5^-pentamethylcyclopentadienyl)-3,4-bis(trimethylsilyl)-2-zirconafuran-5-one-κ<i>O</i>^5^]triisobutylaluminium |
Authors of publication | Burlakov, Vladimir V.; Bogdanov, Vyacheslav S.; Arndt, Perdita; Spannenberg, Anke; Rosenthal, Uwe; Beweries, Torsten; Shur, Vladimir B. |
Journal of publication | Acta Crystallographica Section E |
Year of publication | 2018 |
Journal volume | 74 |
Journal issue | 4 |
Pages of publication | 566 - 568 |
a | 11.5404 ± 0.0002 Å |
b | 16.5073 ± 0.0003 Å |
c | 22.9519 ± 0.0004 Å |
α | 90° |
β | 95.0206 ± 0.0009° |
γ | 90° |
Cell volume | 4355.58 ± 0.13 Å3 |
Cell temperature | 150 ± 2 K |
Ambient diffraction temperature | 150 ± 2 K |
Number of distinct elements | 6 |
Space group number | 14 |
Hermann-Mauguin space group symbol | P 1 21/n 1 |
Hall space group symbol | -P 2yn |
Residual factor for all reflections | 0.0329 |
Residual factor for significantly intense reflections | 0.0256 |
Weighted residual factors for significantly intense reflections | 0.0636 |
Weighted residual factors for all reflections included in the refinement | 0.0676 |
Goodness-of-fit parameter for all reflections included in the refinement | 1.042 |
Diffraction radiation wavelength | 0.71073 Å |
Diffraction radiation type | MoKα |