Information card for entry 2243686
Chemical name |
Potassium terbium bis(molybdate) |
Formula |
K Mo2 O8 Tb |
Calculated formula |
K Mo2 O8 Tb |
Title of publication |
Crystal structures and comparisons of potassium rare-earth molybdates K<i>RE</i>(MoO~4~)~2~ (<i>RE</i> = Tb, Dy, Ho, Er, Yb, and Lu) |
Authors of publication |
Chong, Saehwa; Perry, Samuel; Riley, Brian J.; Nelson, Zayne J. |
Journal of publication |
Acta Crystallographica Section E |
Year of publication |
2020 |
Journal volume |
76 |
Journal issue |
12 |
Pages of publication |
1871 - 1875 |
a |
5.0826 ± 0.0001 Å |
b |
18.1273 ± 0.0007 Å |
c |
7.9875 ± 0.0002 Å |
α |
90° |
β |
90° |
γ |
90° |
Cell volume |
735.92 ± 0.04 Å3 |
Cell temperature |
100 K |
Ambient diffraction temperature |
100 K |
Number of distinct elements |
4 |
Space group number |
60 |
Hermann-Mauguin space group symbol |
P b c n |
Hall space group symbol |
-P 2n 2ab |
Residual factor for all reflections |
0.0354 |
Residual factor for significantly intense reflections |
0.033 |
Weighted residual factors for significantly intense reflections |
0.1 |
Weighted residual factors for all reflections included in the refinement |
0.1022 |
Goodness-of-fit parameter for all reflections |
1.083 |
Goodness-of-fit parameter for all reflections included in the refinement |
1.083 |
Diffraction radiation wavelength |
0.71073 Å |
Diffraction radiation type |
MoKα |
Yes |
No |
Yes |