Information card for entry 2243687
Chemical name |
Potassium dysprosium bis(molybdate) |
Formula |
Dy K Mo2 O8 |
Calculated formula |
Dy K Mo2 O8 |
Title of publication |
Crystal structures and comparisons of potassium rare-earth molybdates K<i>RE</i>(MoO~4~)~2~ (<i>RE</i> = Tb, Dy, Ho, Er, Yb, and Lu) |
Authors of publication |
Chong, Saehwa; Perry, Samuel; Riley, Brian J.; Nelson, Zayne J. |
Journal of publication |
Acta Crystallographica Section E |
Year of publication |
2020 |
Journal volume |
76 |
Journal issue |
12 |
Pages of publication |
1871 - 1875 |
a |
5.0776 ± 0.0002 Å |
b |
18.1214 ± 0.0007 Å |
c |
7.9428 ± 0.0003 Å |
α |
90° |
β |
90° |
γ |
90° |
Cell volume |
730.84 ± 0.05 Å3 |
Cell temperature |
100 K |
Ambient diffraction temperature |
100 K |
Number of distinct elements |
4 |
Space group number |
60 |
Hermann-Mauguin space group symbol |
P b c n |
Hall space group symbol |
-P 2n 2ab |
Residual factor for all reflections |
0.0395 |
Residual factor for significantly intense reflections |
0.0325 |
Weighted residual factors for significantly intense reflections |
0.0849 |
Weighted residual factors for all reflections included in the refinement |
0.0882 |
Goodness-of-fit parameter for all reflections |
1.096 |
Goodness-of-fit parameter for all reflections included in the refinement |
1.096 |
Diffraction radiation wavelength |
0.71073 Å |
Diffraction radiation type |
MoKα |
Yes |
No |
Yes |