Information card for entry 2243688
Chemical name |
Potassium holmium bis(molybdate) |
Formula |
Ho K Mo2 O8 |
Calculated formula |
Ho K Mo2 O8 |
Title of publication |
Crystal structures and comparisons of potassium rare-earth molybdates K<i>RE</i>(MoO~4~)~2~ (<i>RE</i> = Tb, Dy, Ho, Er, Yb, and Lu) |
Authors of publication |
Chong, Saehwa; Perry, Samuel; Riley, Brian J.; Nelson, Zayne J. |
Journal of publication |
Acta Crystallographica Section E |
Year of publication |
2020 |
Journal volume |
76 |
Journal issue |
12 |
Pages of publication |
1871 - 1875 |
a |
5.077 ± 0.0015 Å |
b |
18.161 ± 0.005 Å |
c |
7.934 ± 0.002 Å |
α |
90° |
β |
90° |
γ |
90° |
Cell volume |
731.5 ± 0.3 Å3 |
Cell temperature |
273 K |
Ambient diffraction temperature |
273 K |
Number of distinct elements |
4 |
Space group number |
60 |
Hermann-Mauguin space group symbol |
P b c n |
Hall space group symbol |
-P 2n 2ab |
Residual factor for all reflections |
0.0316 |
Residual factor for significantly intense reflections |
0.0266 |
Weighted residual factors for all reflections |
0.0611 |
Weighted residual factors for all reflections included in the refinement |
0.0625 |
Goodness-of-fit parameter for all reflections |
1.254 |
Goodness-of-fit parameter for all reflections included in the refinement |
1.254 |
Diffraction radiation wavelength |
0.71073 Å |
Diffraction radiation type |
MoKα |
Yes |
No |
Yes |