Information card for entry 2311647
Common name | NF naphthalene-1, 5-disulfonicate |
Formula | C21 H30 F N3 O10 S |
Calculated formula | C21 H30 F N3 O10 S |
Title of publication | Supramolecular structures and physicochemical properties of norfloxacin salts. |
Authors of publication | Xu, Yun; Jiang, Linglei; Mei, Xuefeng |
Journal of publication | Acta crystallographica Section B, Structural science, crystal engineering and materials |
Year of publication | 2014 |
Journal volume | 70 |
Journal issue | Pt 4 |
Pages of publication | 750 - 760 |
a | 9.041 ± 0.003 Å |
b | 10.767 ± 0.003 Å |
c | 12.438 ± 0.003 Å |
α | 89.118 ± 0.019° |
β | 81.88 ± 0.017° |
γ | 74.64 ± 0.02° |
Cell volume | 1155.5 ± 0.6 Å3 |
Cell temperature | 100 ± 2 K |
Ambient diffraction temperature | 100 ± 2 K |
Number of distinct elements | 6 |
Space group number | 2 |
Hermann-Mauguin space group symbol | P -1 |
Hall space group symbol | -P 1 |
Residual factor for all reflections | 0.1043 |
Residual factor for significantly intense reflections | 0.047 |
Weighted residual factors for significantly intense reflections | 0.0657 |
Weighted residual factors for all reflections included in the refinement | 0.0752 |
Goodness-of-fit parameter for all reflections included in the refinement | 1.077 |
Diffraction radiation wavelength | 0.71073 Å |
Diffraction radiation type | MoKα |