Information card for entry 2311648
Common name | NF naphthalene-2-sulfonicate |
Formula | C26 H23 F N3 O10 S |
Calculated formula | C26 H23 F N3 O10 S |
Title of publication | Supramolecular structures and physicochemical properties of norfloxacin salts. |
Authors of publication | Xu, Yun; Jiang, Linglei; Mei, Xuefeng |
Journal of publication | Acta crystallographica Section B, Structural science, crystal engineering and materials |
Year of publication | 2014 |
Journal volume | 70 |
Journal issue | Pt 4 |
Pages of publication | 750 - 760 |
a | 11.6515 ± 0.0003 Å |
b | 7.4209 ± 0.0002 Å |
c | 61.8325 ± 0.0018 Å |
α | 90° |
β | 90° |
γ | 90° |
Cell volume | 5346.3 ± 0.3 Å3 |
Cell temperature | 100 ± 2 K |
Ambient diffraction temperature | 100 ± 2 K |
Number of distinct elements | 6 |
Space group number | 61 |
Hermann-Mauguin space group symbol | P b c a |
Hall space group symbol | -P 2ac 2ab |
Residual factor for all reflections | 0.1241 |
Residual factor for significantly intense reflections | 0.0679 |
Weighted residual factors for significantly intense reflections | 0.1431 |
Weighted residual factors for all reflections included in the refinement | 0.1643 |
Goodness-of-fit parameter for all reflections included in the refinement | 1.115 |
Diffraction radiation wavelength | 0.71073 Å |
Diffraction radiation type | MoKα |