Information card for entry 2312437
Formula |
B2 K O6 Sr Y |
Calculated formula |
B2 K O6 Sr Y |
Title of publication |
Growth, crystal structure and IR luminescence of KSrY<sub>1-x</sub>Er<sub>x</sub>(BO<sub>3</sub>)<sub>2</sub>. |
Authors of publication |
Kuznetsov, Artem B.; Kokh, Konstantin A.; Gorelova, Liudmila A.; Sofich, Dmitry O.; Sagatov, Nursultan; Gavryushkin, Pavel N.; Vereshchagin, Oleg S.; Bocharov, Vladimir N.; Shevchenko, Vyacheslav S.; Kokh, Alexander E. |
Journal of publication |
Acta crystallographica Section B, Structural science, crystal engineering and materials |
Year of publication |
2024 |
Journal volume |
80 |
Journal issue |
2 |
a |
6.594 ± 0.0004 Å |
b |
5.3718 ± 0.0003 Å |
c |
8.5241 ± 0.0005 Å |
α |
90° |
β |
105.39 ± 0.007° |
γ |
90° |
Cell volume |
291.11 ± 0.03 Å3 |
Cell temperature |
305 ± 2 K |
Ambient diffraction temperature |
305 ± 2 K |
Number of distinct elements |
5 |
Space group number |
11 |
Hermann-Mauguin space group symbol |
P 1 21/m 1 |
Hall space group symbol |
-P 2yb |
Residual factor for all reflections |
0.07 |
Residual factor for significantly intense reflections |
0.0637 |
Weighted residual factors for significantly intense reflections |
0.1754 |
Weighted residual factors for all reflections included in the refinement |
0.1807 |
Goodness-of-fit parameter for all reflections included in the refinement |
0.987 |
Diffraction radiation wavelength |
0.71073 Å |
Diffraction radiation type |
MoKα |
Yes |
No |
Yes |