Information card for entry 2312438
Original IUCr paper | HTML |
Formula | C12 H24 Cl6 O6 Rb Sb |
Calculated formula | C12 H24 Cl6 O6 Rb Sb |
Title of publication | Attractive and repulsive forces in a crystal of [Rb(18-crown-6)][SbCl<sub>6</sub>] under high pressure. |
Authors of publication | Rusanov, Eduard B.; Wörle, Michael D; Kovalenko, Maksym V.; Domasevitch, Kostiantyn V.; Rusanova, Julia A. |
Journal of publication | Acta crystallographica Section B, Structural science, crystal engineering and materials |
Year of publication | 2024 |
Journal volume | 80 |
Journal issue | Pt 2 |
Pages of publication | 135 - 145 |
a | 14.0325 ± 0.0007 Å |
b | 14.0325 ± 0.0007 Å |
c | 9.9333 ± 0.0006 Å |
α | 90° |
β | 90° |
γ | 120° |
Cell volume | 1693.93 ± 0.16 Å3 |
Cell temperature | 100 ± 0.1 K |
Ambient diffraction temperature | 100 ± 0.1 K |
Number of distinct elements | 6 |
Space group number | 148 |
Hermann-Mauguin space group symbol | R -3 :H |
Hall space group symbol | -R 3 |
Residual factor for all reflections | 0.0239 |
Residual factor for significantly intense reflections | 0.0205 |
Weighted residual factors for significantly intense reflections | 0.0451 |
Weighted residual factors for all reflections included in the refinement | 0.046 |
Goodness-of-fit parameter for all reflections included in the refinement | 1.054 |
Diffraction radiation probe | x-ray |
Diffraction radiation wavelength | 0.71073 Å |
Diffraction radiation type | MoKα |