Information card for entry 4001777
Formula | Cd2 Cs2 In2 Te6 |
Calculated formula | Cd2 Cs2 In2 Te6 |
Title of publication | CsCdInQ3(Q = Se, Te): New Photoconductive Compounds As Potential Materials for Hard Radiation Detection |
Authors of publication | Li, Hao; Malliakas, Christos D.; Peters, John A.; Liu, Zhifu; Im, Jino; Jin, Hosub; Morris, Collin D.; Zhao, Li-Dong; Wessels, Bruce W.; Freeman, Arthur J.; Kanatzidis, Mercouri G. |
Journal of publication | Chemistry of Materials |
Year of publication | 2013 |
Journal volume | 25 |
Journal issue | 10 |
Pages of publication | 2089 |
a | 12.523 ± 0.003 Å |
b | 12.517 ± 0.003 Å |
c | 24.441 ± 0.005 Å |
α | 90° |
β | 97.38 ± 0.03° |
γ | 90° |
Cell volume | 3799.4 ± 1.5 Å3 |
Cell temperature | 293 ± 2 K |
Ambient diffraction temperature | 293 ± 2 K |
Number of distinct elements | 4 |
Space group number | 15 |
Hermann-Mauguin space group symbol | C 1 2/c 1 |
Hall space group symbol | -C 2yc |
Residual factor for all reflections | 0.0762 |
Residual factor for significantly intense reflections | 0.0434 |
Weighted residual factors for significantly intense reflections | 0.0991 |
Weighted residual factors for all reflections included in the refinement | 0.1105 |
Goodness-of-fit parameter for all reflections included in the refinement | 0.986 |
Diffraction radiation wavelength | 0.71073 Å |
Diffraction radiation type | MoKα |