Information card for entry 4023552
Formula | C14 H11 B F2 N2 O |
Calculated formula | C14 H11 B F2 N2 O |
SMILES | F[B]1(OC(=N[N]1=Cc1ccccc1)c1ccccc1)F |
Title of publication | Trifluoromethylation of N-Benzoylhydrazones |
Authors of publication | Alexander D. Dilman; Dmitry E. Arkhipov; Vitalij V. Levin; Pavel A. Belyakov; Alexander A. Korlyukov; Marina I. Struchkova; Vladimir A. Tartakovsky |
Journal of publication | Journal of Organic Chemistry |
Year of publication | 2008 |
Journal volume | 73 |
Pages of publication | 5643 - 5646 |
a | 6.2348 ± 0.0005 Å |
b | 15.1197 ± 0.0013 Å |
c | 13.0329 ± 0.0011 Å |
α | 90° |
β | 93.737 ± 0.002° |
γ | 90° |
Cell volume | 1225.98 ± 0.18 Å3 |
Cell temperature | 100 ± 2 K |
Ambient diffraction temperature | 100 ± 2 K |
Number of distinct elements | 6 |
Space group number | 14 |
Hermann-Mauguin space group symbol | P 1 21/n 1 |
Hall space group symbol | -P 2yn |
Residual factor for all reflections | 0.0742 |
Residual factor for significantly intense reflections | 0.0451 |
Weighted residual factors for significantly intense reflections | 0.1072 |
Weighted residual factors for all reflections included in the refinement | 0.12 |
Goodness-of-fit parameter for all reflections included in the refinement | 1.007 |
Diffraction radiation wavelength | 0.71073 Å |
Diffraction radiation type | MoKα |