Information card for entry 4023873
Formula | C105 H136 F24 N6 O35 P4 |
Calculated formula | C105 H132 F24 N6 O35 P4 |
Title of publication | High-Yielding, Regiospecific Synthesis of cis(4,4')-Di(carbomethoxybenzo)-30-crown-10, Its Conversion to a Pyridyl Cryptand and Strong Complexation of 2,2'- and 4,4'-Bipyridinium Derivatives |
Authors of publication | Adam M.-P. Pederson; Elizabeth M. Ward; Daniel V. Schoonover; Carla Slebodnick; Harry W. Gibson |
Journal of publication | Journal of Organic Chemistry |
Year of publication | 2008 |
Journal volume | 73 |
Pages of publication | 9094 - 9101 |
a | 13.9741 ± 0.0004 Å |
b | 16.8936 ± 0.0005 Å |
c | 26.4827 ± 0.0005 Å |
α | 89.867 ± 0.002° |
β | 81.082 ± 0.002° |
γ | 85.426 ± 0.002° |
Cell volume | 6156.3 ± 0.3 Å3 |
Cell temperature | 100 ± 2 K |
Ambient diffraction temperature | 100 ± 2 K |
Number of distinct elements | 6 |
Space group number | 2 |
Hermann-Mauguin space group symbol | P -1 |
Hall space group symbol | -P 1 |
Residual factor for all reflections | 0.141 |
Residual factor for significantly intense reflections | 0.0621 |
Weighted residual factors for significantly intense reflections | 0.1545 |
Weighted residual factors for all reflections included in the refinement | 0.1694 |
Goodness-of-fit parameter for all reflections included in the refinement | 0.848 |
Diffraction radiation probe | x-ray |
Diffraction radiation wavelength | 0.71073 Å |
Diffraction radiation type | MoKα |