Information card for entry 4023874
Formula | C13 H15 N S |
Calculated formula | C13 H15 N S |
SMILES | C12CCC(CC1)N2C(=S)c1ccccc1 |
Title of publication | Nonplanar Structures of Thioamides Derived from 7-Azabicyclo[2.2.1]heptane. Electronically Tunable Planarity of Thioamides |
Authors of publication | Tetsuharu Hori; Yuko Otani; Masatoshi Kawahata; Kentaro Yamaguchi; Tomohiko Ohwada |
Journal of publication | Journal of Organic Chemistry |
Year of publication | 2008 |
Journal volume | 73 |
Pages of publication | 9102 - 9108 |
a | 11.0169 ± 0.0017 Å |
b | 14.654 ± 0.002 Å |
c | 28.298 ± 0.005 Å |
α | 90° |
β | 90° |
γ | 90° |
Cell volume | 4568.4 ± 1.3 Å3 |
Cell temperature | 150 K |
Ambient diffraction temperature | 150 K |
Number of distinct elements | 4 |
Space group number | 61 |
Hermann-Mauguin space group symbol | P b c a |
Hall space group symbol | -P 2ac 2ab |
Residual factor for all reflections | 0.0763 |
Residual factor for significantly intense reflections | 0.0471 |
Weighted residual factors for significantly intense reflections | 0.1071 |
Weighted residual factors for all reflections included in the refinement | 0.1263 |
Goodness-of-fit parameter for all reflections included in the refinement | 1.018 |
Diffraction radiation wavelength | 0.71073 Å |
Diffraction radiation type | MoKα |