Information card for entry 4023876
Formula | C14 H17 N S |
Calculated formula | C14 H17 N S |
SMILES | C12CCC(CC1)N2C(=S)c1ccc(cc1)C |
Title of publication | Nonplanar Structures of Thioamides Derived from 7-Azabicyclo[2.2.1]heptane. Electronically Tunable Planarity of Thioamides |
Authors of publication | Tetsuharu Hori; Yuko Otani; Masatoshi Kawahata; Kentaro Yamaguchi; Tomohiko Ohwada |
Journal of publication | Journal of Organic Chemistry |
Year of publication | 2008 |
Journal volume | 73 |
Pages of publication | 9102 - 9108 |
a | 7.789 ± 0.002 Å |
b | 17.671 ± 0.005 Å |
c | 17.796 ± 0.005 Å |
α | 90° |
β | 90° |
γ | 90° |
Cell volume | 2449.2 ± 1.2 Å3 |
Cell temperature | 90 K |
Ambient diffraction temperature | 90 K |
Number of distinct elements | 4 |
Space group number | 19 |
Hermann-Mauguin space group symbol | P 21 21 21 |
Hall space group symbol | P 2ac 2ab |
Residual factor for all reflections | 0.1163 |
Residual factor for significantly intense reflections | 0.0657 |
Weighted residual factors for significantly intense reflections | 0.1362 |
Weighted residual factors for all reflections included in the refinement | 0.16 |
Goodness-of-fit parameter for all reflections included in the refinement | 0.992 |
Diffraction radiation wavelength | 0.71073 Å |
Diffraction radiation type | MoKα |