Information card for entry 4023875
Formula | C15 H20 N2 S |
Calculated formula | C15 H20 N2 S |
SMILES | C12CCC(CC1)N2C(=S)c1ccc(cc1)N(C)C |
Title of publication | Nonplanar Structures of Thioamides Derived from 7-Azabicyclo[2.2.1]heptane. Electronically Tunable Planarity of Thioamides |
Authors of publication | Tetsuharu Hori; Yuko Otani; Masatoshi Kawahata; Kentaro Yamaguchi; Tomohiko Ohwada |
Journal of publication | Journal of Organic Chemistry |
Year of publication | 2008 |
Journal volume | 73 |
Pages of publication | 9102 - 9108 |
a | 7.6862 ± 0.0008 Å |
b | 7.7203 ± 0.0008 Å |
c | 22.579 ± 0.002 Å |
α | 90° |
β | 91.162 ± 0.002° |
γ | 90° |
Cell volume | 1339.6 ± 0.2 Å3 |
Cell temperature | 90 K |
Ambient diffraction temperature | 90 K |
Number of distinct elements | 4 |
Space group number | 14 |
Hermann-Mauguin space group symbol | P 1 21/n 1 |
Hall space group symbol | -P 2yn |
Residual factor for all reflections | 0.0457 |
Residual factor for significantly intense reflections | 0.037 |
Weighted residual factors for significantly intense reflections | 0.101 |
Weighted residual factors for all reflections included in the refinement | 0.1066 |
Goodness-of-fit parameter for all reflections included in the refinement | 1.107 |
Diffraction radiation wavelength | 0.71073 Å |
Diffraction radiation type | MoKα |