Information card for entry 4024752
Formula | C13 H16 F2 N2 O2 |
Calculated formula | C13 H16 F2 N2 O2 |
SMILES | FC1(F)CN(Cc2ccc(cc2)N(=O)=O)CC(C1)C |
Title of publication | Substitution Effect on the Cylization/Fluorination Reaction of N-Dienes in Superacid |
Authors of publication | Emilie Vardelle; Agnès Martin-Mingot; Marie-Paule Jouannetaud; Christian Bachmann; Jérôme Marrot; Sébastien Thibaudeau |
Journal of publication | Journal of Organic Chemistry |
Year of publication | 2009 |
Journal volume | 74 |
Pages of publication | 6025 - 6034 |
a | 7.228 ± 0.0006 Å |
b | 10.5893 ± 0.0008 Å |
c | 17.5653 ± 0.0012 Å |
α | 90° |
β | 92.462 ± 0.003° |
γ | 90° |
Cell volume | 1343.2 ± 0.18 Å3 |
Cell temperature | 296 ± 2 K |
Ambient diffraction temperature | 296 ± 2 K |
Number of distinct elements | 5 |
Space group number | 14 |
Hermann-Mauguin space group symbol | P 1 21/c 1 |
Hall space group symbol | -P 2ybc |
Residual factor for all reflections | 0.0836 |
Residual factor for significantly intense reflections | 0.0475 |
Weighted residual factors for significantly intense reflections | 0.1164 |
Weighted residual factors for all reflections included in the refinement | 0.1388 |
Goodness-of-fit parameter for all reflections included in the refinement | 1.015 |
Diffraction radiation wavelength | 0.71073 Å |
Diffraction radiation type | MoKα |