Information card for entry 4024753
Formula | C13 H16 Cl F N2 O2 |
Calculated formula | C13 H16 Cl F N2 O2 |
SMILES | Cl[C@@]1(F)CN(Cc2ccc(N(=O)=O)cc2)C[C@H](C1)C.Cl[C@]1(F)CN(Cc2ccc(N(=O)=O)cc2)C[C@@H](C1)C |
Title of publication | Substitution Effect on the Cylization/Fluorination Reaction of N-Dienes in Superacid |
Authors of publication | Emilie Vardelle; Agnès Martin-Mingot; Marie-Paule Jouannetaud; Christian Bachmann; Jérôme Marrot; Sébastien Thibaudeau |
Journal of publication | Journal of Organic Chemistry |
Year of publication | 2009 |
Journal volume | 74 |
Pages of publication | 6025 - 6034 |
a | 14.867 ± 0.005 Å |
b | 9.84 ± 0.003 Å |
c | 9.475 ± 0.003 Å |
α | 90° |
β | 95.475 ± 0.01° |
γ | 90° |
Cell volume | 1379.7 ± 0.8 Å3 |
Cell temperature | 200 ± 2 K |
Ambient diffraction temperature | 200 ± 2 K |
Number of distinct elements | 6 |
Space group number | 14 |
Hermann-Mauguin space group symbol | P 1 21/c 1 |
Hall space group symbol | -P 2ybc |
Residual factor for all reflections | 0.0821 |
Residual factor for significantly intense reflections | 0.0689 |
Weighted residual factors for significantly intense reflections | 0.1783 |
Weighted residual factors for all reflections included in the refinement | 0.1802 |
Goodness-of-fit parameter for all reflections included in the refinement | 1.058 |
Diffraction radiation wavelength | 0.71073 Å |
Diffraction radiation type | MoKα |