Information card for entry 4024988
Common name | tetra(2,6-dimethyl-4-methoxyphenyl)pyrene |
Chemical name | tetra(2,6-dimethyl-4-methoxyphenyl)pyrene |
Formula | C56 H58 Cl4 O4 |
Calculated formula | C56 H58 Cl4 O4 |
SMILES | c12c(cc(c3c(C)cc(OC)cc3C)c3c1c1c(cc3)c(cc(c1cc2)c1c(cc(OC)cc1C)C)c1c(cc(OC)cc1C)C)c1c(cc(OC)cc1C)C.C(CCl)Cl.C(CCl)Cl |
Title of publication | Abundant Lattice Inclusion Phenomenon with Sterically Hindered and Inherently Shape-Selective Tetraarylpyrenes |
Authors of publication | Jarugu Narasimha Moorthy; Palani Natarajan; Paloth Venugopalan |
Journal of publication | Journal of Organic Chemistry |
Year of publication | 2009 |
Journal volume | 74 |
Pages of publication | 8566 - 8577 |
a | 7.8862 ± 0.0019 Å |
b | 21.289 ± 0.005 Å |
c | 15.369 ± 0.004 Å |
α | 90° |
β | 95.306 ± 0.005° |
γ | 90° |
Cell volume | 2569.3 ± 1.1 Å3 |
Cell temperature | 100 ± 2 K |
Ambient diffraction temperature | 100 ± 2 K |
Number of distinct elements | 4 |
Space group number | 14 |
Hermann-Mauguin space group symbol | P 1 21/c 1 |
Hall space group symbol | -P 2ybc |
Residual factor for all reflections | 0.1202 |
Residual factor for significantly intense reflections | 0.0615 |
Weighted residual factors for significantly intense reflections | 0.147 |
Weighted residual factors for all reflections included in the refinement | 0.1694 |
Goodness-of-fit parameter for all reflections included in the refinement | 1.023 |
Diffraction radiation wavelength | 0.71073 Å |
Diffraction radiation type | MoKα |