Information card for entry 4024989
Common name | tetra(2,6-dimethyl-4-methoxyphenyl)pyrene |
Chemical name | tetra(2,6-dimethyl-4-methoxyphenyl)pyrene |
Formula | C62 H66 O8 |
Calculated formula | C62 H66 O8 |
SMILES | c12c3c(cc(c1ccc1c2c(c(cc1c1c(cc(OC)cc1C)C)c1c(cc(OC)cc1C)C)cc3)c1c(cc(OC)cc1C)C)c1c(cc(OC)cc1C)C.OC(=C\C(=O)C)/C.O/C(=C\C(=O)C)C |
Title of publication | Abundant Lattice Inclusion Phenomenon with Sterically Hindered and Inherently Shape-Selective Tetraarylpyrenes |
Authors of publication | Jarugu Narasimha Moorthy; Palani Natarajan; Paloth Venugopalan |
Journal of publication | Journal of Organic Chemistry |
Year of publication | 2009 |
Journal volume | 74 |
Pages of publication | 8566 - 8577 |
a | 12.0718 ± 0.0014 Å |
b | 14.7862 ± 0.0016 Å |
c | 14.424 ± 0.0017 Å |
α | 90° |
β | 95.414 ± 0.002° |
γ | 90° |
Cell volume | 2563.1 ± 0.5 Å3 |
Cell temperature | 100 ± 2 K |
Ambient diffraction temperature | 100 ± 2 K |
Number of distinct elements | 3 |
Space group number | 14 |
Hermann-Mauguin space group symbol | P 1 21/c 1 |
Hall space group symbol | -P 2ybc |
Residual factor for all reflections | 0.0781 |
Residual factor for significantly intense reflections | 0.0545 |
Weighted residual factors for significantly intense reflections | 0.1281 |
Weighted residual factors for all reflections included in the refinement | 0.1394 |
Goodness-of-fit parameter for all reflections included in the refinement | 1.032 |
Diffraction radiation wavelength | 0.71073 Å |
Diffraction radiation type | MoKα |