Information card for entry 4024992
Common name | tetra(2,6-dimethyl-4-methoxyphenyl)pyrene |
Chemical name | tetra(2,6-dimethyl-4-methoxyphenyl)pyrene |
Formula | C76 H94 Br4 O4 |
Calculated formula | C76 H94 Br4 O4 |
Title of publication | Abundant Lattice Inclusion Phenomenon with Sterically Hindered and Inherently Shape-Selective Tetraarylpyrenes |
Authors of publication | Jarugu Narasimha Moorthy; Palani Natarajan; Paloth Venugopalan |
Journal of publication | Journal of Organic Chemistry |
Year of publication | 2009 |
Journal volume | 74 |
Pages of publication | 8566 - 8577 |
a | 34.929 ± 0.005 Å |
b | 10.6781 ± 0.0014 Å |
c | 21.169 ± 0.004 Å |
α | 90° |
β | 120.491 ± 0.006° |
γ | 90° |
Cell volume | 6803.6 ± 1.9 Å3 |
Cell temperature | 100 ± 2 K |
Ambient diffraction temperature | 100 ± 2 K |
Number of distinct elements | 4 |
Space group number | 15 |
Hermann-Mauguin space group symbol | C 1 2/c 1 |
Hall space group symbol | -C 2yc |
Residual factor for all reflections | 0.1625 |
Residual factor for significantly intense reflections | 0.0867 |
Weighted residual factors for significantly intense reflections | 0.2166 |
Weighted residual factors for all reflections included in the refinement | 0.2524 |
Goodness-of-fit parameter for all reflections included in the refinement | 1.048 |
Diffraction radiation wavelength | 0.71073 Å |
Diffraction radiation type | MoKα |