Information card for entry 4024993
Common name | tetra(2,6-dimethyl-4-methoxyphenyl)pyrene |
Chemical name | tetra(2,6-dimethyl-4-methoxyphenyl)pyrene |
Formula | C64 H66 O6 |
Calculated formula | C64 H66 O6 |
Title of publication | Abundant Lattice Inclusion Phenomenon with Sterically Hindered and Inherently Shape-Selective Tetraarylpyrenes |
Authors of publication | Jarugu Narasimha Moorthy; Palani Natarajan; Paloth Venugopalan |
Journal of publication | Journal of Organic Chemistry |
Year of publication | 2009 |
Journal volume | 74 |
Pages of publication | 8566 - 8577 |
a | 20.317 ± 0.004 Å |
b | 21.978 ± 0.004 Å |
c | 22.803 ± 0.004 Å |
α | 90° |
β | 108.346 ± 0.006° |
γ | 90° |
Cell volume | 9665 ± 3 Å3 |
Cell temperature | 100 ± 2 K |
Ambient diffraction temperature | 100 ± 2 K |
Number of distinct elements | 3 |
Space group number | 15 |
Hermann-Mauguin space group symbol | C 1 2/c 1 |
Hall space group symbol | -C 2yc |
Residual factor for all reflections | 0.1362 |
Residual factor for significantly intense reflections | 0.0848 |
Weighted residual factors for significantly intense reflections | 0.2056 |
Weighted residual factors for all reflections included in the refinement | 0.2332 |
Goodness-of-fit parameter for all reflections included in the refinement | 1.033 |
Diffraction radiation wavelength | 0.71073 Å |
Diffraction radiation type | MoKα |