Information card for entry 4030498
Formula | C6 H11 S Tl |
Calculated formula | C6 S Tl |
Title of publication | Novel main group thiolates as possible sulfide precursors in CVD. Preparation, structures, and properties of Tl(SC6H11) and Pb(Sc6H4-p-CH3)2 |
Authors of publication | Krebs, B.; Brommelhaus, A.; Kersting, B.; Nienhaus, M. |
Journal of publication | European Journal of Solid State and Inorganic Chemistry |
Year of publication | 1992 |
Journal volume | 29 |
Journal issue | Supp |
Pages of publication | 167 - 170 |
a | 9.104 ± 0.003 Å |
b | 28.309 ± 0.008 Å |
c | 11.968 ± 0.003 Å |
α | 90° |
β | 92.13 ± 0.03° |
γ | 90° |
Cell volume | 3082.3 ± 1.5 Å3 |
Ambient diffraction temperature | 150 K |
Number of distinct elements | 4 |
Space group number | 14 |
Hermann-Mauguin space group symbol | P 1 21/n 1 |
Hall space group symbol | -P 2yn |
Residual factor for significantly intense reflections | 0.0323 |
Weighted residual factors for significantly intense reflections | 0.0459 |
Diffraction radiation probe | x-ray |
Diffraction radiation wavelength | 0.71019 Å |
Diffraction radiation type | MoKα |