Information card for entry 4030499
Formula | C14 H14 Pb S2 |
Calculated formula | C14 Pb S2 |
Title of publication | Novel main group thiolates as possible sulfide precursors in CVD. Preparation, structures, and properties of Tl(SC6H11) and Pb(Sc6H4-p-CH3)2 |
Authors of publication | Krebs, B.; Brommelhaus, A.; Kersting, B.; Nienhaus, M. |
Journal of publication | European Journal of Solid State and Inorganic Chemistry |
Year of publication | 1992 |
Journal volume | 29 |
Journal issue | Supp |
Pages of publication | 167 - 170 |
a | 31.929 ± 0.034 Å |
b | 5.966 ± 0.005 Å |
c | 7.178 ± 0.006 Å |
α | 90° |
β | 94.6 ± 0.08° |
γ | 90° |
Cell volume | 1363 ± 2 Å3 |
Ambient diffraction temperature | 150 K |
Number of distinct elements | 4 |
Space group number | 14 |
Hermann-Mauguin space group symbol | P 1 21/c 1 |
Hall space group symbol | -P 2ybc |
Residual factor for significantly intense reflections | 0.0309 |
Weighted residual factors for significantly intense reflections | 0.0419 |
Diffraction radiation probe | x-ray |
Diffraction radiation wavelength | 0.71019 Å |
Diffraction radiation type | MoKα |