Information card for entry 4034360
Formula | C6 H9 F3 O3 |
Calculated formula | C6 H9 F3 O3 |
SMILES | F[C@H]1[C@@H](O[C@@H]([C@H](F)[C@@H]1F)CO)O |
Title of publication | Synthesis of 2,3,4-Trideoxy-2,3,4-trifluoroglucose. |
Authors of publication | Quiquempoix, Lucas; Wang, Zhong; Graton, Jérôme; Latchem, Peter G.; Light, Mark; Le Questel, Jean-Yves; Linclau, Bruno |
Journal of publication | The Journal of organic chemistry |
Year of publication | 2019 |
Journal volume | 84 |
Journal issue | 9 |
Pages of publication | 5899 - 5906 |
a | 5.0898 ± 0.0014 Å |
b | 7.4264 ± 0.0013 Å |
c | 9.842 ± 0.003 Å |
α | 90° |
β | 102.18 ± 0.03° |
γ | 90° |
Cell volume | 363.64 ± 0.17 Å3 |
Cell temperature | 100 ± 2 K |
Ambient diffraction temperature | 100 ± 2 K |
Number of distinct elements | 4 |
Space group number | 4 |
Hermann-Mauguin space group symbol | P 1 21 1 |
Hall space group symbol | P 2yb |
Residual factor for all reflections | 0.0985 |
Residual factor for significantly intense reflections | 0.0891 |
Weighted residual factors for significantly intense reflections | 0.245 |
Weighted residual factors for all reflections included in the refinement | 0.2599 |
Goodness-of-fit parameter for all reflections included in the refinement | 1.113 |
Diffraction radiation probe | x-ray |
Diffraction radiation wavelength | 0.71073 Å |
Diffraction radiation type | MoKα |