Information card for entry 4066113
Formula | C49 H79 N2 O3 Si Y |
Calculated formula | C49 H79 N2 O3 Si Y |
Title of publication | Lanthanide Alkyl Complexes Supported by a Piperazidine-Bridged Bis(phenolato) Ligand: Synthesis, Structural Characterization, and Catalysis for the Polymerization ofl-Lactide andrac-Lactide |
Authors of publication | Luo, Yunjie; Li, Wenyi; Lin, Dan; Yao, Yingming; Zhang, Yong; Shen, Qi |
Journal of publication | Organometallics |
Year of publication | 2010 |
Journal volume | 29 |
Journal issue | 16 |
Pages of publication | 3507 |
a | 16.688 ± 0.007 Å |
b | 11.356 ± 0.005 Å |
c | 26.146 ± 0.011 Å |
α | 90° |
β | 90.627 ± 0.007° |
γ | 90° |
Cell volume | 4955 ± 4 Å3 |
Cell temperature | 223 ± 2 K |
Ambient diffraction temperature | 223 ± 2 K |
Number of distinct elements | 6 |
Space group number | 14 |
Hermann-Mauguin space group symbol | P 1 21/n 1 |
Hall space group symbol | -P 2yn |
Residual factor for all reflections | 0.128 |
Residual factor for significantly intense reflections | 0.0959 |
Weighted residual factors for significantly intense reflections | 0.1852 |
Weighted residual factors for all reflections included in the refinement | 0.2023 |
Goodness-of-fit parameter for all reflections included in the refinement | 1.17 |
Diffraction radiation wavelength | 0.71075 Å |
Diffraction radiation type | MoKα |