Information card for entry 4066114
Formula | C56 H87 Lu N2 O3 Si |
Calculated formula | C56 H87 Lu N2 O3 Si |
Title of publication | Lanthanide Alkyl Complexes Supported by a Piperazidine-Bridged Bis(phenolato) Ligand: Synthesis, Structural Characterization, and Catalysis for the Polymerization ofl-Lactide andrac-Lactide |
Authors of publication | Luo, Yunjie; Li, Wenyi; Lin, Dan; Yao, Yingming; Zhang, Yong; Shen, Qi |
Journal of publication | Organometallics |
Year of publication | 2010 |
Journal volume | 29 |
Journal issue | 16 |
Pages of publication | 3507 |
a | 14.747 ± 0.003 Å |
b | 15.629 ± 0.003 Å |
c | 24.663 ± 0.005 Å |
α | 90° |
β | 96.423 ± 0.005° |
γ | 90° |
Cell volume | 5649 ± 2 Å3 |
Cell temperature | 223 ± 2 K |
Ambient diffraction temperature | 223 ± 2 K |
Number of distinct elements | 6 |
Space group number | 14 |
Hermann-Mauguin space group symbol | P 1 21/n 1 |
Hall space group symbol | -P 2yn |
Residual factor for all reflections | 0.1125 |
Residual factor for significantly intense reflections | 0.0901 |
Weighted residual factors for significantly intense reflections | 0.2197 |
Weighted residual factors for all reflections included in the refinement | 0.2406 |
Goodness-of-fit parameter for all reflections included in the refinement | 1.124 |
Diffraction radiation wavelength | 0.71075 Å |
Diffraction radiation type | MoKα |