Information card for entry 4068866
Formula | C20 H29 Cl N O P Sn |
Calculated formula | C20 H29 Cl N O P Sn |
SMILES | [Sn]1(Cl)([O]=P(N(C(C)C)C(C)C)(c2c1cccc2)c1ccccc1)(C)C |
Title of publication | An Unprecedented Phosphinamidic Gold(III) Metallocycle: Synthesis via Tin(IV) Precursors, Structure, and Multicomponent Catalysis |
Authors of publication | Oña-Burgos, Pascual; Fernández, Ignacio; Roces, Laura; Torre Fernández, Laura; García-Granda, Santiago; López Ortiz, Fernando |
Journal of publication | Organometallics |
Year of publication | 2009 |
Journal volume | 28 |
Journal issue | 6 |
Pages of publication | 1739 |
a | 9.169 ± 0.001 Å |
b | 9.787 ± 0.004 Å |
c | 14.324 ± 0.005 Å |
α | 96.62 ± 0.003° |
β | 102.16 ± 0.02° |
γ | 115.1 ± 0.02° |
Cell volume | 1107.1 ± 0.7 Å3 |
Cell temperature | 293 ± 2 K |
Ambient diffraction temperature | 293 ± 2 K |
Number of distinct elements | 7 |
Space group number | 2 |
Hermann-Mauguin space group symbol | P -1 |
Hall space group symbol | -P 1 |
Residual factor for all reflections | 0.0729 |
Residual factor for significantly intense reflections | 0.0408 |
Weighted residual factors for significantly intense reflections | 0.068 |
Weighted residual factors for all reflections included in the refinement | 0.0763 |
Goodness-of-fit parameter for all reflections included in the refinement | 0.968 |
Diffraction radiation wavelength | 0.71073 Å |
Diffraction radiation type | MoKα |